Target
Solute carrier family 15 member 1
Ligand
BDBM50136985
Substrate
Meas. Tech.
ChEMBL_89213 (CHEMBL699705)
Ki
110000±n/a nM
Citation
 Gebauer, SKnütter, IHartrodt, BBrandsch, MNeubert, KThondorf, I Three-dimensional quantitative structure-activity relationship analyses of peptide substrates of the mammalian H+/peptide cotransporter PEPT1. J Med Chem 46:5725-34 (2003)  
Target
Name:
Solute carrier family 15 member 1
Synonyms:
Intestinal H(+)/peptide cotransporter Oligopeptide transporter, small intestine isoform Peptide transporter 1 SLC15A1
Type:
PROTEIN
Mol. Mass.:
78818.07
Organism:
Homo sapiens (Human)
Description:
ChEMBL_1488839
Residue:
708
  
Inhibitor
Name:
BDBM50136985
Synonyms:
1-(2-ammonio-4-methylpentanoyl)pyrrolidine-2-carboxylate | CHEMBL156723
Type:
Small organic molecule
Emp. Form.:
C11H20N2O3
Mol. Mass.:
228.2881
SMILES:
CC(C)CC([NH3+])C(=O)N1CCCC1C([O-])=O
: