Target
Adenosine receptor A3
Ligand
BDBM50370311
Substrate
Meas. Tech.
ChEMBL_29901 (CHEMBL641972)
Ki
577±n/a nM
Citation
 Beukers, MWWanner, MJVon Frijtag Drabbe Künzel, JKKlaasse, ECIJzerman, APKoomen, GJ N6-cyclopentyl-2-(3-phenylaminocarbonyltriazene-1-yl)adenosine (TCPA), a very selective agonist with high affinity for the human adenosine A1 receptor. J Med Chem 46:1492-503 (2003)  
Target
Name:
Adenosine receptor A3
Synonyms:
A3 adenosine receptor (hA3) ADORA3 | Adenosine A3 receptor (A3AR)
Type:
G Protein-Coupled Receptor (GPCR)
Mol. Mass.:
36197.32
Organism:
Homo sapiens (Human)
Description:
P0DMS8
Residue:
318
  
Inhibitor
Name:
BDBM50370311
Synonyms:
CHEMBL603394
Type:
Small organic molecule
Emp. Form.:
C17H18N8O6
Mol. Mass.:
430.3748
SMILES:
Nc1nc(NN=NC(=O)Oc2ccccc2)nc2n(cnc12)C1O[C@H](CO)[C@@H](O)[C@H]1O
: