Target
Mitogen-activated protein kinase 10
Ligand
BDBM50149239
Substrate
Meas. Tech.
ChEMBL_216836 (CHEMBL820420)
Ki
720±n/a nM
Citation
 Erlanson, DAMcDowell, RSO'Brien, T Fragment-based drug discovery. J Med Chem 47:3463-82 (2004)  
Target
Name:
Mitogen-activated protein kinase 10
Synonyms:
JNK3 MAP kinase p49 3F12 MK10_HUMAN Mitogen-activated protein kinase 10 (Stress-activated protein kinase JNK3) (c-Jun N-terminal kinase 3) (MAP kinase p49 3F12) PRKM10 Stress-activated protein kinase JNK3 | c-Jun N-terminal kinase 3 (JNK3)
Type:
Enzyme
Mol. Mass.:
52586.89
Organism:
Homo sapiens (Human)
Description:
Residue:
464
  
Inhibitor
Name:
BDBM50149239
Synonyms:
2,4-Dioxo-6-phenylamino-1,2,3,4-tetrahydro-pyrimidine-5-carboxylic acid phenylamide | CHEMBL117120
Type:
Small organic molecule
Emp. Form.:
C17H14N4O3
Mol. Mass.:
322.3181
SMILES:
O=C(Nc1ccccc1)c1c(Nc2ccccc2)[nH]c(=O)[nH]c1=O
: