Target
Collagenase 3
Ligand
BDBM50149235
Substrate
Meas. Tech.
ChEMBL_106644 (CHEMBL717028)
IC50
15±n/a nM
Citation
 Erlanson, DAMcDowell, RSO'Brien, T Fragment-based drug discovery. J Med Chem 47:3463-82 (2004)  
Target
Name:
Collagenase 3
Synonyms:
MMP-13 MMP13_HUMAN Matrix metalloproteinase-13 (MMP-13) | Matrix metalloproteinase-13 (MMP13)
Type:
Enzyme
Mol. Mass.:
53808.06
Organism:
Homo sapiens (Human)
Description:
P45452
Residue:
471
  
Inhibitor
Name:
BDBM50149235
Synonyms:
2-[Benzyl-(4-methoxy-benzenesulfonyl)-amino]-N-hydroxy-3,5-dimethyl-benzamide | CHEMBL331834
Type:
Small organic molecule
Emp. Form.:
C23H24N2O5S
Mol. Mass.:
440.512
SMILES:
COc1ccc(cc1)S(=O)(=O)N(Cc1ccccc1)c1c(C)cc(C)cc1C(=O)NO
: