Target
Kappa-type opioid receptor
Ligand
BDBM50105483
Substrate
Meas. Tech.
ChEMBL_147223 (CHEMBL754911)
Ki
0.034000±n/a nM
Citation
 Zhang, AXiong, WHilbert, JEDeVita, EKBidlack, JMNeumeyer, JL 2-aminothiazole-derived opioids. Bioisosteric replacement of phenols. J Med Chem 47:1886-8 (2004)  
Target
Name:
Kappa-type opioid receptor
Synonyms:
K-OR-1 Kappa-opioid receptor (KOR) Kappa-type opioid receptor (KOR) OPIATE Kappa OPRK1 kappa opioid receptor (KOR)
Type:
G Protein-Coupled Receptor (GPCR)
Mol. Mass.:
42648.76
Organism:
Homo sapiens (Human)
Description:
P41145
Residue:
380
  
Inhibitor
Name:
BDBM50105483
Synonyms:
(-)-cyclorphan 17-cyclopropylmethyl-(9R)-17-azatetracyclo[7.5.3.01,10.02,7]heptadeca-2(7),3,5-trien-4-ol CHEMBL291468
Type:
Small organic molecule
Emp. Form.:
C20H27NO
Mol. Mass.:
297.4345
SMILES:
Oc1ccc2C[C@@H]3C4CCCC[C@]4(CCN3CC3CC3)c2c1
: