Target
D(4) dopamine receptor
Ligand
BDBM50102712
Substrate
Meas. Tech.
ChEMBL_60675 (CHEMBL674046)
Ki
2.7±n/a nM
Citation
 Stewart, AOCowart, MDMoreland, RBLatshaw, SPMatulenko, MABhatia, PAWang, XDaanen, JFNelson, SLTerranova, MANamovic, MTDonnelly-Roberts, DLMiller, LNNakane, MSullivan, JPBrioni, JD Dopamine D4 ligands and models of receptor activation: 2-(4-pyridin-2-ylpiperazin-1-ylmethyl)-1H-benzimidazole and related heteroarylmethylarylpiperazines exhibit a substituent effect responsible for additional efficacy tuning. J Med Chem 47:2348-55 (2004)  
Target
Name:
D(4) dopamine receptor
Synonyms:
D(2C) dopamine receptor DOPAMINE D4.2 DRD4 Dopamine D4 receptor
Type:
Enzyme
Mol. Mass.:
48373.19
Organism:
Homo sapiens (Human)
Description:
P21917
Residue:
419
  
Inhibitor
Name:
BDBM50102712
Synonyms:
2-((4-(4-chlorophenyl)piperazin-1-yl)methyl)-pyrazolo[1,5-a]pyridine 2-[4-(4-Chloro-phenyl)-piperazin-1-ylmethyl]-pyrazolo[1,5-a]pyridine CHEMBL310843
Type:
Small organic molecule
Emp. Form.:
C18H19ClN4
Mol. Mass.:
326.823
SMILES:
Clc1ccc(cc1)N1CCN(Cc2cc3ccccn3n2)CC1
: