Target
Oxysterols receptor LXR-alpha
Ligand
BDBM50167696
Substrate
Meas. Tech.
ChEMBL_304312 (CHEMBL830107)
EC50
>50000±n/a nM
Citation
 Singh, SBOndeyka, JGLiu, WChen, SChen, TSLi, XBouffard, ADropinski, JJones, ABMcCormick, SHayes, NWang, JSharma, NMacnaul, KHernandez, MChao, YSBaffic, JLam, MHBurton, CSparrow, CPMenke, JG Discovery and development of dimeric podocarpic acid leads as potent agonists of liver X receptor with HDL cholesterol raising activity in mice and hamsters. Bioorg Med Chem Lett 15:2824-8 (2005)  
Target
Name:
Oxysterols receptor LXR-alpha
Synonyms:
LXRA Liver X receptor alpha Liver X receptor alpha (NR1H3) NR1H3 Nuclear orphan receptor LXR-alpha | Nuclear receptor subfamily 1 group H member 3
Type:
Enzyme Catalytic Domain
Mol. Mass.:
50403.85
Organism:
Homo sapiens (Human)
Description:
Q13133
Residue:
447
  
Inhibitor
Name:
BDBM50167696
Synonyms:
(1S,4aS,10aR)-1,2,3,4,4a,9,10,10a-octahydro-6-hydroxy-1,4a-dimethylphenanthrene-1-carboxylic acid 12-hydroxypodocarpa-8,11,13-trien-16-oic acid Podocarpic acid
Type:
Small organic molecule
Emp. Form.:
C17H22O3
Mol. Mass.:
274.3548
SMILES:
C[C@@]1(CCC[C@@]2(C)[C@H]1CCc1ccc(O)cc21)C(O)=O
: