Target
D(2) dopamine receptor
Ligand
BDBM50097343
Substrate
Meas. Tech.
ChEMBL_306213 (CHEMBL831122)
IC50
199±n/a nM
Citation
 Kamei, KMaeda, NKatsuragi-Ogino, RKoyama, MNakajima, MTatsuoka, TOhno, TInoue, T New piperidinyl- and 1,2,3,6-tetrahydropyridinyl-pyrimidine derivatives as selective 5-HT1A receptor agonists with highly potent anti-ischemic effects. Bioorg Med Chem Lett 15:2990-3 (2005)  
Target
Name:
D(2) dopamine receptor
Synonyms:
DOPAMINE D2 DOPAMINE D2 Short Dopamine D2 receptor Drd2
Type:
G Protein-Coupled Receptor (GPCR)
Mol. Mass.:
50931.60
Organism:
Rattus norvegicus (rat)
Description:
P61169
Residue:
444
  
Inhibitor
Name:
BDBM50097343
Synonyms:
3-Chloro-4-[4-(4-pyrimidin-2-yl-piperazin-1-yl)-butyl]-4H-benzo[f][1,4]oxazepin-5-one | CHEMBL347167
Type:
Small organic molecule
Emp. Form.:
C21H24ClN5O2
Mol. Mass.:
413.901
SMILES:
ClC1=COc2ccccc2C(=O)N1CCCCN1CCN(CC1)c1ncccn1
: