Target
Carbonic anhydrase 12
Ligand
BDBM10858
Substrate
Meas. Tech.
ChEMBL_303220 (CHEMBL827186)
Ki
11±n/a nM
Citation
 Nishimori, IVullo, DInnocenti, AScozzafava, AMastrolorenzo, ASupuran, CT Carbonic anhydrase inhibitors: inhibition of the transmembrane isozyme XIV with sulfonamides. Bioorg Med Chem Lett 15:3828-33 (2005)  
Target
Name:
Carbonic anhydrase 12
Synonyms:
CA-XII CAH12_HUMAN Carbonic anhydrase Carbonic anhydrase XII Carbonic anhydrase XII (CAXII) | Tumor antigen HOM-RCC-3.1.3
Type:
Enzyme
Mol. Mass.:
39456.00
Organism:
Homo sapiens (Human)
Description:
Catalytic domain of human cloned isozyme was used in the assay
Residue:
354
  
Inhibitor
Name:
BDBM10858
Synonyms:
4-hydrazinylbenzene-1-sulfonamide aromatic/heteroaromatic sulfonamide 3 | hydrazide deriv. 14
Type:
Small organic molecule
Emp. Form.:
C6H9N3O2S
Mol. Mass.:
187.22
SMILES:
NNc1ccc(cc1)S(N)(=O)=O
: