Target
Carbonic anhydrase 9
Ligand
BDBM10872
Substrate
Meas. Tech.
ChEMBL_303196 (CHEMBL829822)
Ki
24±n/a nM
Citation
 Nishimori, IVullo, DInnocenti, AScozzafava, AMastrolorenzo, ASupuran, CT Carbonic anhydrase inhibitors: inhibition of the transmembrane isozyme XIV with sulfonamides. Bioorg Med Chem Lett 15:3828-33 (2005)  
Target
Name:
Carbonic anhydrase 9
Synonyms:
CA-IX CAH9_HUMAN Carbonic anhydrase 9 (CA IX) Carbonic anhydrase 9 precursor Carbonic anhydrase IX (CAIX) Carbonic anhydrases; II & IX MN RCC-associated antigen G250
Type:
Enzyme
Mol. Mass.:
49669.03
Organism:
Homo sapiens (Human)
Description:
Catalytic domain of human cloned isozyme was used in the assay
Residue:
459
  
Inhibitor
Name:
BDBM10872
Synonyms:
4-amino-N-[2-(4-sulfamoylphenyl)ethyl]benzene-1-sulfonamide aromatic/heteroaromatic sulfonamide 17
Type:
Small organic molecule
Emp. Form.:
C14H17N3O4S2
Mol. Mass.:
355.432
SMILES:
Nc1ccc(cc1)S(=O)(=O)NCCc1ccc(cc1)S(N)(=O)=O
: