Target
Acetylcholinesterase
Ligand
BDBM50169873
Substrate
Meas. Tech.
ChEMBL_306522 (CHEMBL827273)
IC50
1960±n/a nM
Citation
 Sheng, RLin, XLi, JJiang, YShang, ZHu, Y Design, synthesis, and evaluation of 2-phenoxy-indan-1-one derivatives as acetylcholinesterase inhibitors. Bioorg Med Chem Lett 15:3834-7 (2005)  
Target
Name:
Acetylcholinesterase
Synonyms:
ACES_RAT Acetylcholinesterase and butyrylcholinesterase (AChE and BChE) Acetylcholinesterase, AChE | Ache
Type:
Enzyme
Mol. Mass.:
68193.62
Organism:
Rattus norvegicus (rat)
Description:
P37136
Residue:
614
  
Inhibitor
Name:
BDBM50169873
Synonyms:
5,6-Dimethoxy-2-[3-(1-pyrrolidin-1-yl-ethyl)-phenoxy]-indan-1-one | CHEMBL182252
Type:
Small organic molecule
Emp. Form.:
C23H27NO4
Mol. Mass.:
381.4648
SMILES:
COc1cc2CC(Oc3cccc(c3)C(C)N3CCCC3)C(=O)c2cc1OC
: