Target
Carbonic anhydrase 13
Ligand
BDBM10862
Substrate
Meas. Tech.
ChEMBL_302395 (CHEMBL840830)
Ki
50±n/a nM
Citation
 Vullo, DVoipio, JInnocenti, ARivera, CRanki, HScozzafava, AKaila, KSupuran, CT Carbonic anhydrase inhibitors. Inhibition of the human cytosolic isozyme VII with aromatic and heterocyclic sulfonamides. Bioorg Med Chem Lett 15:971-6 (2005)  
Target
Name:
Carbonic anhydrase 13
Synonyms:
CA-XIII Ca13 Carbonate dehydratase XIII Carbonic anhydrase XIII
Type:
Enzyme
Mol. Mass.:
29522.80
Organism:
Mus musculus (mouse)
Description:
Murine cloned isozyme
Residue:
262
  
Inhibitor
Name:
BDBM10862
Synonyms:
4-Amino-3-fluorobenzenesulfonamide CHEMBL6853 halogenosulfanilamide deriv. 5b
Type:
Small organic molecule
Emp. Form.:
C6H7FN2O2S
Mol. Mass.:
190.195
SMILES:
Nc1ccc(cc1F)S(N)(=O)=O
: