Target
Adenosine receptor A3
Ligand
BDBM21220
Substrate
Meas. Tech.
ChEMBL_303329 (CHEMBL840054)
Ki
34.8±n/a nM
Citation
 Baraldi, PGFruttarolo, FTabrizi, MARomagnoli, RPreti, DBovero, APineda de Las Infantas, MJMoorman, AVarani, KBorea, PA Synthesis and biological evaluation of novel N6-[4-(substituted)sulfonamidophenylcarbamoyl]adenosine-5'-uronamides as A3 adenosine receptor agonists. J Med Chem 47:5535-40 (2004)  
Target
Name:
Adenosine receptor A3
Synonyms:
A3 adenosine receptor (hA3) ADORA3 | Adenosine A3 receptor (A3AR)
Type:
G Protein-Coupled Receptor (GPCR)
Mol. Mass.:
36197.32
Organism:
Homo sapiens (Human)
Description:
P0DMS8
Residue:
318
  
Inhibitor
Name:
BDBM21220
Synonyms:
(2S,3S,4R,5R)-5-(6-amino-9H-purin-9-yl)-N-ethyl-3,4-dihydroxyoxolane-2-carboxamide Adenosine, N6-Ethyl-carboxamido CHEMBL464859 NECA
Type:
Antineoplastic Agent
Emp. Form.:
C12H16N6O4
Mol. Mass.:
308.2932
SMILES:
CCNC(=O)[C@H]1O[C@H]([C@H](O)[C@@H]1O)n1cnc2c(N)ncnc12
: