Target
D(4) dopamine receptor
Ligand
BDBM50161214
Substrate
Meas. Tech.
ChEMBL_303044 (CHEMBL828014)
Ki
375±n/a nM
Citation
 Newman, AHGrundt, PNader, MA Dopamine D3 receptor partial agonists and antagonists as potential drug abuse therapeutic agents. J Med Chem 48:3663-79 (2005)  
Target
Name:
D(4) dopamine receptor
Synonyms:
D(2C) dopamine receptor DOPAMINE D4.2 DRD4 Dopamine D4 receptor
Type:
Enzyme
Mol. Mass.:
48373.19
Organism:
Homo sapiens (Human)
Description:
P21917
Residue:
419
  
Inhibitor
Name:
BDBM50161214
Synonyms:
CHEMBL180010 N-{4-[4-(2,3-Dichloro-phenyl)-piperazin-1-yl]-but-2-enyl}-4-pyridin-2-yl-benzamide | PG-01037
Type:
Small organic molecule
Emp. Form.:
C26H26Cl2N4O
Mol. Mass.:
481.417
SMILES:
Clc1cccc(N2CCN(C\C=C\CNC(=O)c3ccc(cc3)-c3ccccn3)CC2)c1Cl
: