Target
Sodium-dependent serotonin transporter
Ligand
BDBM50035729
Substrate
Meas. Tech.
ChEMBL_303285 (CHEMBL828278)
Ki
22.0±n/a nM
Citation
 Carroll, FITyagi, SBlough, BEKuhar, MJNavarro, HA Synthesis and monoamine transporter binding properties of 3alpha-(substituted phenyl)nortropane-2beta-carboxylic acid methyl esters. Norepinephrine transporter selective compounds. J Med Chem 48:3852-7 (2005)  
Target
Name:
Sodium-dependent serotonin transporter
Synonyms:
5-HT Transporter 5HT transporter Anandamid membrane transporter, AMT Monoamine transporters; Norepinephrine & serotonin Slc6a4 Sodium-dependent serotonin transporter (SERT) | imipramine receptor
Type:
Multi-pass membrane protein
Mol. Mass.:
70168.43
Organism:
Rattus norvegicus (rat)
Description:
P31652
Residue:
630
  
Inhibitor
Name:
BDBM50035729
Synonyms:
8-Methyl-3-p-tolyl-8-aza-bicyclo[3.2.1]octane CHEMBL82027
Type:
Small organic molecule
Emp. Form.:
C17H23NO2
Mol. Mass.:
273.37
SMILES:
COC(=O)C1C2CCC(CC1c1ccc(C)cc1)N2C
: