Target
Sigma non-opioid intracellular receptor 1
Ligand
BDBM50170663
Substrate
Meas. Tech.
ChEMBL_303441 (CHEMBL839610)
Ki
1000±n/a nM
Citation
 Laggner, CSchieferer, CFiechtner, BPoles, GHoffmann, RDGlossmann, HLanger, TMoebius, FF Discovery of high-affinity ligands of sigma1 receptor, ERG2, and emopamil binding protein by pharmacophore modeling and virtual screening. J Med Chem 48:4754-64 (2005)  
Target
Name:
Sigma non-opioid intracellular receptor 1
Synonyms:
Aging-associated gene 8 protein SGMR1_HUMAN SIGMAR1 SR31747-binding protein Sigma 1-type opioid receptor Sigma1R | hSigmaR1
Type:
Enzyme Catalytic Domain
Mol. Mass.:
25124.85
Organism:
Homo sapiens (Human)
Description:
Q99720
Residue:
223
  
Inhibitor
Name:
BDBM50170663
Synonyms:
(7S,8R)-7,8-Dimethyl-6-(3-methyl-but-2-enylamino)-8-propyl-5,6,7,8-tetrahydro-naphthalen-2-ol | CHEMBL305593
Type:
Small organic molecule
Emp. Form.:
C19H27NO
Mol. Mass.:
285.4238
SMILES:
[H][C@@]1([#6])[#6]-2-[#6]-c3ccc(-[#8])cc3[C@]1([#6])[#6]-[#6]-[#7]-2-[#6]\[#6]=[#6](\[#6])-[#6]
: