Target
C-8 sterol isomerase ERG2
Ligand
BDBM50170652
Substrate
Meas. Tech.
ChEMBL_303390 (CHEMBL839961)
Ki
0.09±n/a nM
Citation
 Laggner, CSchieferer, CFiechtner, BPoles, GHoffmann, RDGlossmann, HLanger, TMoebius, FF Discovery of high-affinity ligands of sigma1 receptor, ERG2, and emopamil binding protein by pharmacophore modeling and virtual screening. J Med Chem 48:4754-64 (2005)  
Target
Name:
C-8 sterol isomerase ERG2
Synonyms:
C-8 sterol isomerase ERG2 | ERG2_YEAST
Type:
PROTEIN
Mol. Mass.:
24892.29
Organism:
Saccharomyces cerevisiae
Description:
ChEMBL_303390
Residue:
222
  
Inhibitor
Name:
BDBM50170652
Synonyms:
(2R,6S)-2,6-Dimethyl-4-tridecyl-morpholine | CHEMBL365842
Type:
Small organic molecule
Emp. Form.:
C19H39NO
Mol. Mass.:
297.5191
SMILES:
CCCCCCCCCCCCCN1C[C@H](C)O[C@H](C)C1
: