Target
C-8 sterol isomerase ERG2
Ligand
BDBM50170651
Substrate
Meas. Tech.
ChEMBL_303390 (CHEMBL839961)
Ki
0.20±n/a nM
Citation
 Laggner, CSchieferer, CFiechtner, BPoles, GHoffmann, RDGlossmann, HLanger, TMoebius, FF Discovery of high-affinity ligands of sigma1 receptor, ERG2, and emopamil binding protein by pharmacophore modeling and virtual screening. J Med Chem 48:4754-64 (2005)  
Target
Name:
C-8 sterol isomerase ERG2
Synonyms:
C-8 sterol isomerase ERG2 | ERG2_YEAST
Type:
PROTEIN
Mol. Mass.:
24892.29
Organism:
Saccharomyces cerevisiae
Description:
ChEMBL_303390
Residue:
222
  
Inhibitor
Name:
BDBM50170651
Synonyms:
(3S,8R,9S,10R,13S,14S)-3-(2-Diethylamino-ethoxy)-10,13-dimethyl-1,2,3,4,7,8,9,10,11,12,13,14,15,16-tetradecahydro-cyclopenta[a]phenanthren-17-one | CHEMBL365141
Type:
Small organic molecule
Emp. Form.:
C25H41NO2
Mol. Mass.:
387.5985
SMILES:
CCN(CC)CCO[C@H]1CC[C@]2(C)[C@H]3CC[C@@]4(C)[C@@H](CCC4=O)[C@@H]3CC=C2C1
: