Target
Cytochrome P450 2A5
Ligand
BDBM50159242
Substrate
Meas. Tech.
ChEMBL_305268 (CHEMBL832818)
IC50
4100±n/a nM
Citation
 Rahnasto, MRaunio, HPoso, AWittekindt, CJuvonen, RO Quantitative structure-activity relationship analysis of inhibitors of the nicotine metabolizing CYP2A6 enzyme. J Med Chem 48:440-9 (2005)  
Target
Name:
Cytochrome P450 2A5
Synonyms:
CP2A5_MOUSE Cyp2a5
Type:
PROTEIN
Mol. Mass.:
56752.73
Organism:
Mus musculus
Description:
ChEMBL_572014
Residue:
494
  
Inhibitor
Name:
BDBM50159242
Synonyms:
1-(7-Methyl-naphthalen-2-yl)-ethanone CHEMBL447481
Type:
Small organic molecule
Emp. Form.:
C13H12O
Mol. Mass.:
184.2338
SMILES:
CC(=O)c1ccc2ccc(C)cc2c1
: