Target
Cytochrome P450 2A5
Ligand
BDBM50159264
Substrate
Meas. Tech.
ChEMBL_305268 (CHEMBL832818)
IC50
5500±n/a nM
Citation
 Rahnasto, MRaunio, HPoso, AWittekindt, CJuvonen, RO Quantitative structure-activity relationship analysis of inhibitors of the nicotine metabolizing CYP2A6 enzyme. J Med Chem 48:440-9 (2005)  
Target
Name:
Cytochrome P450 2A5
Synonyms:
CP2A5_MOUSE Cyp2a5
Type:
PROTEIN
Mol. Mass.:
56752.73
Organism:
Mus musculus
Description:
ChEMBL_572014
Residue:
494
  
Inhibitor
Name:
BDBM50159264
Synonyms:
1,2-Dichloro-naphthalene CHEMBL364891
Type:
Small organic molecule
Emp. Form.:
C10H6Cl2
Mol. Mass.:
197.061
SMILES:
Clc1ccc2ccccc2c1Cl
: