Target
D(1B) dopamine receptor
Ligand
BDBM50164588
Substrate
Meas. Tech.
ChEMBL_302418 (CHEMBL828822)
Ki
0.18±n/a nM
Citation
 Di Stefano, ASozio, PCacciatore, ICocco, AGiorgioni, GCosta, BMontali, MLucacchini, AMartini, CSpoto, GDi Pietrantonio, FDi Matteo, EPinnen, F Preparation and pharmacological characterization of trans-2-amino-5(6)-fluoro-6(5)-hydroxy-1-phenyl-2,3-dihydro-1H-indenes as D2-like dopamine receptor agonists. J Med Chem 48:2646-54 (2005)  
Target
Name:
D(1B) dopamine receptor
Synonyms:
Dopamine D5 receptor
Type:
Mol. Mass.:
Description:
ASSAY_ID of EBI is 302529
Components:
This complex has 2 components.
Component 1
Name:
D(1B) dopamine receptor
Synonyms:
D(5) dopamine receptor DOPAMINE D5 DRD1L2 DRD5_HUMAN | dopamine receptor D5
Type:
Protein
Mol. Mass.:
52943.41
Organism:
Homo sapiens (Human)
Description:
P21918
Residue:
477
  
Component 2
Name:
D(1B) dopamine receptor
Synonyms:
D(1B) dopamine receptor DRD5_RAT Dopamine D5 receptor Drd5
Type:
Enzyme Catalytic Domain
Mol. Mass.:
52827.88
Organism:
RAT
Description:
Dopamine D1B 0 RAT::P25115
Residue:
475
  
Inhibitor
Name:
BDBM50164588
Synonyms:
1-[1-(2-Chloro-phenyl)-cyclopropyl]-6-fluoro-2-methyl-1,2,3,4-tetrahydro-isoquinolin-7-ol | CHEMBL192788
Type:
Small organic molecule
Emp. Form.:
C19H19ClFNO
Mol. Mass.:
331.812
SMILES:
CN1CCc2cc(F)c(O)cc2C1C1(CC1)c1ccccc1Cl
: