Target
Cyclin-dependent kinase 2
Ligand
BDBM7646
Substrate
Meas. Tech.
ChEBML_304863
IC50
10±n/a nM
Citation
 Putta, SLandrum, GAPenzotti, JE Conformation mining: an algorithm for finding biologically relevant conformations. J Med Chem 48:3313-8 (2005)  
Target
Name:
Cyclin-dependent kinase 2
Synonyms:
CDK2 CDK2_HUMAN Cell division protein kinase 2 Protein cereblon/Cyclin-dependent kinase 2 | p33 protein kinase
Type:
Enzyme Subunit
Mol. Mass.:
33938.17
Organism:
Homo sapiens (Human)
Description:
P24941
Residue:
298
  
Inhibitor
Name:
BDBM7646
Synonyms:
CHEMBL102926 N-{4-[3-(dimethylamino)-2-hydroxypropoxy]phenyl}-4-{2-methylimidazo[1,2-a]pyridin-3-yl}pyrimidin-2-amine
Type:
Small organic molecule
Emp. Form.:
C23H26N6O2
Mol. Mass.:
418.4915
SMILES:
CN(C)CC(O)COc1ccc(Nc2nccc(n2)-c2c(C)nc3ccccn23)cc1
: