Target
Deoxyuridine 5'-triphosphate nucleotidohydrolase
Ligand
BDBM50173550
Substrate
Meas. Tech.
ChEMBL_320965 (CHEMBL885372)
Ki
5000±n/a nM
Citation
 Nguyen, CKasinathan, GLeal-Cortijo, IMusso-Buendia, AKaiser, MBrun, RRuiz-Pérez, LMJohansson, NGGonzález-Pacanowska, DGilbert, IH Deoxyuridine triphosphate nucleotidohydrolase as a potential antiparasitic drug target. J Med Chem 48:5942-54 (2005)  
Target
Name:
Deoxyuridine 5'-triphosphate nucleotidohydrolase
Synonyms:
dUTP pyrophosphatase
Type:
Protein
Mol. Mass.:
19574.43
Organism:
Plasmodium falciparum
Description:
Q8II92
Residue:
173
  
Inhibitor
Name:
BDBM50173550
Synonyms:
1-(4-Fluoro-5-trityloxymethyl-tetrahydro-furan-2-yl)-1H-pyrimidine-2,4-dione | CHEMBL197951
Type:
Small organic molecule
Emp. Form.:
C28H25FN2O4
Mol. Mass.:
472.5075
SMILES:
FC1CC(OC1COC(c1ccccc1)(c1ccccc1)c1ccccc1)n1ccc(=O)[nH]c1=O
: