Target
Endothelin-converting enzyme 1
Ligand
BDBM50115848
Substrate
Meas. Tech.
ChEMBL_320760 (CHEMBL884574)
Ki
10.0±n/a nM
Citation
 Morphy, RRankovic, Z Designed multiple ligands. An emerging drug discovery paradigm. J Med Chem 48:6523-43 (2005)  
Target
Name:
Endothelin-converting enzyme 1
Synonyms:
ECE-1 ECE1_HUMAN Endothelin-converting enzyme 1 (ECE1)
Type:
Enzyme
Mol. Mass.:
87155.11
Organism:
Homo sapiens (Human)
Description:
P42892
Residue:
770
  
Inhibitor
Name:
BDBM50115848
Synonyms:
(S)-3-(1H-Indol-3-yl)-2-[(R)-3-mercapto-2-((S)-5-methoxy-indan-1-yl)-propionylamino]-propionic acid | CHEMBL305388
Type:
Small organic molecule
Emp. Form.:
C24H26N2O4S
Mol. Mass.:
438.539
SMILES:
COc1ccc2[C@@H](CCc2c1)[C@@H](CS)C(=O)N[C@@H](Cc1c[nH]c2ccccc12)C(O)=O
: