Target
Adenosine receptor A2b
Ligand
BDBM50176060
Substrate
Meas. Tech.
ChEMBL_321017 (CHEMBL883650)
Ki
518±n/a nM
Citation
 Minetti, PTinti, MOCarminati, PCastorina, MDi Cesare, MADi Serio, SGallo, GGhirardi, OGiorgi, FGiorgi, LPiersanti, GBartoccini, FTarzia, G 2-n-Butyl-9-methyl-8-[1,2,3]triazol-2-yl-9H-purin-6-ylamine and analogues as A2A adenosine receptor antagonists. Design, synthesis, and pharmacological characterization. J Med Chem 48:6887-96 (2005)  
Target
Name:
Adenosine receptor A2b
Synonyms:
AA2BR_HUMAN ADORA2B Adenosine receptors A2b | Adenosine receptors; A2a & A2b
Type:
G Protein-Coupled Receptor (GPCR)
Mol. Mass.:
36341.22
Organism:
Homo sapiens (Human)
Description:
Residue:
332
  
Inhibitor
Name:
BDBM50176060
Synonyms:
1-Methyl-2-[1,2,3]triazol-2-yl-1H-imidazo[4,5-c]pyridin-4-ylamine | CHEMBL198200
Type:
Small organic molecule
Emp. Form.:
C9H9N7
Mol. Mass.:
215.2147
SMILES:
Cn1c(nc2c(N)nccc12)-n1nccn1
: