Target
Aldo-keto reductase family 1 member C3
Ligand
BDBM50339185
Substrate
Meas. Tech.
ChEMBL_326008 (CHEMBL869399)
IC50
480±n/a nM
Citation
 Gobec, SBrozic, PRizner, TL Nonsteroidal anti-inflammatory drugs and their analogues as inhibitors of aldo-keto reductase AKR1C3: new lead compounds for the development of anticancer agents. Bioorg Med Chem Lett 15:5170-5 (2005)  
Target
Name:
Aldo-keto reductase family 1 member C3
Synonyms:
17-beta-Hydroxysteroid Dehydrogenase 5 (17-beta-HSD5, AKR1C3) AK1C3_HUMAN Aldo-keto reductase family 1 member C3 Aldo-keto reductase family 1 member C3 (AK1C3a) Aldo-keto-reductase family 1 member C3 Dihydrodiol dehydrogenase 3 Estradiol 17-beta-dehydrogenase KIAA0119 Prostaglandin F synthase Trans-1,2-dihydrobenzene-1,2-diol dehydrogenase
Type:
Enzyme
Mol. Mass.:
36859.86
Organism:
Homo sapiens (Human)
Description:
P42330
Residue:
323
  
Inhibitor
Name:
BDBM50339185
Synonyms:
(2S)-2-(6-methoxynaphthalen-2-yl)propanoic acid (S)-2-(6-methoxynaphthalen-2-yl)propanoic acid 2-(6-Methoxy-naphthalen-2-yl)-propionic acid 2-(6-methoxy-2-naphthyl)propanoic acid Aleve CHEMBL154 Equiproxen Naprosyn Naproxen2-(6-Methoxy-naphthalen-2-yl)-propionic acid S-NAPROXEN naproxene
Type:
Small organic molecule
Emp. Form.:
C14H14O3
Mol. Mass.:
230.2592
SMILES:
COc1ccc2cc(ccc2c1)[C@H](C)C(O)=O
: