Target
Oxytocin receptor
Ligand
BDBM50178160
Substrate
Meas. Tech.
ChEMBL_326537 (CHEMBL863355)
Ki
620±n/a nM
Citation
 Quattropani, ADorbais, JCovini, DPittet, PAColovray, VThomas, RJCoxhead, RHalazy, SScheer, AMissotten, MAyala, GBradshaw, CDe Raemy-Schenk, AMNichols, ACirillo, RTos, EGGiachetti, CGolzio, LMarinelli, PChurch, DJBarberis, CChollet, ASchwarz, MK Discovery and development of a new class of potent, selective, orally active oxytocin receptor antagonists. J Med Chem 48:7882-905 (2005)  
Target
Name:
Oxytocin receptor
Synonyms:
OT-R OXYR_HUMAN | Oxytocin
Type:
Enzyme Catalytic Domain
Mol. Mass.:
42793.26
Organism:
Homo sapiens (Human)
Description:
Oxytocin OXTR HEK293::B2R9L7
Residue:
389
  
Inhibitor
Name:
BDBM50178160
Synonyms:
CHEMBL198780 | N-(3-chloro-2-methylphenyl)-2-(3,4-dimethoxy-N-p-tolylphenylsulfonamido)acetamide
Type:
Small organic molecule
Emp. Form.:
C24H25ClN2O5S
Mol. Mass.:
488.984
SMILES:
COc1ccc(cc1OC)S(=O)(=O)N(CC(=O)Nc1cccc(Cl)c1C)c1ccc(C)cc1
: