Target
Oxytocin receptor
Ligand
BDBM50178210
Substrate
Meas. Tech.
ChEMBL_326537 (CHEMBL863355)
Ki
90±n/a nM
Citation
 Quattropani, ADorbais, JCovini, DPittet, PAColovray, VThomas, RJCoxhead, RHalazy, SScheer, AMissotten, MAyala, GBradshaw, CDe Raemy-Schenk, AMNichols, ACirillo, RTos, EGGiachetti, CGolzio, LMarinelli, PChurch, DJBarberis, CChollet, ASchwarz, MK Discovery and development of a new class of potent, selective, orally active oxytocin receptor antagonists. J Med Chem 48:7882-905 (2005)  
Target
Name:
Oxytocin receptor
Synonyms:
OT-R OXYR_HUMAN | Oxytocin
Type:
Enzyme Catalytic Domain
Mol. Mass.:
42793.26
Organism:
Homo sapiens (Human)
Description:
Oxytocin OXTR HEK293::B2R9L7
Residue:
389
  
Inhibitor
Name:
BDBM50178210
Synonyms:
CHEMBL382546 | N'-(2-oxo-3,3a-dihydro-2H-inden-1(7aH)-ylidene)-2-(N-phenylphenylsulfonamido)acetohydrazide
Type:
Small organic molecule
Emp. Form.:
C22H20N4O4S
Mol. Mass.:
436.484
SMILES:
O=C(CN(c1ccccc1)S(=O)(=O)c1ccccc1)NN=C1C(=O)NC2C=CCC=C12
: