Target
Oxytocin receptor
Ligand
BDBM50410621
Substrate
Meas. Tech.
ChEMBL_326541 (CHEMBL863361)
Ki
25±n/a nM
Citation
 Quattropani, ADorbais, JCovini, DPittet, PAColovray, VThomas, RJCoxhead, RHalazy, SScheer, AMissotten, MAyala, GBradshaw, CDe Raemy-Schenk, AMNichols, ACirillo, RTos, EGGiachetti, CGolzio, LMarinelli, PChurch, DJBarberis, CChollet, ASchwarz, MK Discovery and development of a new class of potent, selective, orally active oxytocin receptor antagonists. J Med Chem 48:7882-905 (2005)  
Target
Name:
Oxytocin receptor
Synonyms:
OT-R Otr Oxytocin
Type:
Enzyme Catalytic Domain
Mol. Mass.:
42889.28
Organism:
RAT
Description:
Oxytocin OXTR RAT::P70536
Residue:
388
  
Inhibitor
Name:
BDBM50410621
Synonyms:
CHEMBL2113177
Type:
Small organic molecule
Emp. Form.:
C28H29ClN6O5S
Mol. Mass.:
597.085
SMILES:
Clc1ccc(cc1)N(CC(=O)N\N=C1/C(=O)Nc2ccccc12)S(=O)(=O)c1ccc(NCCN2CCOCC2)cc1
: