Target
Oxytocin receptor
Ligand
BDBM50410634
Substrate
Meas. Tech.
ChEMBL_326537 (CHEMBL863355)
Ki
1.6±n/a nM
Citation
 Quattropani, ADorbais, JCovini, DPittet, PAColovray, VThomas, RJCoxhead, RHalazy, SScheer, AMissotten, MAyala, GBradshaw, CDe Raemy-Schenk, AMNichols, ACirillo, RTos, EGGiachetti, CGolzio, LMarinelli, PChurch, DJBarberis, CChollet, ASchwarz, MK Discovery and development of a new class of potent, selective, orally active oxytocin receptor antagonists. J Med Chem 48:7882-905 (2005)  
Target
Name:
Oxytocin receptor
Synonyms:
OT-R OXYR_HUMAN | Oxytocin
Type:
Enzyme Catalytic Domain
Mol. Mass.:
42793.26
Organism:
Homo sapiens (Human)
Description:
Oxytocin OXTR HEK293::B2R9L7
Residue:
389
  
Inhibitor
Name:
BDBM50410634
Synonyms:
CHEMBL2113189
Type:
Small organic molecule
Emp. Form.:
C28H28ClN5O6S
Mol. Mass.:
598.07
SMILES:
CN(C)CCCOc1ccc(cc1)S(=O)(=O)N(CC(=O)N\N=C1/C(=O)NC(=O)c2ccccc12)c1ccc(Cl)cc1
: