Target
cAMP-specific 3',5'-cyclic phosphodiesterase 4B
Ligand
BDBM50174025
Substrate
Meas. Tech.
ChEMBL_326770 (CHEMBL860120)
IC50
0.3±n/a nM
Citation
 Macdonald, DMastracchio, APerrier, HDubé, DGallant, MLacombe, PDeschênes, DRoy, BScheigetz, JBateman, KLi, CTrimble, LADay, SChauret, NNicoll-Griffith, DASilva, JMHuang, ZLaliberté, FLiu, SEthier, DPon, DMuise, EBoulet, LChan, CCStyhler, ACharleson, SMancini, JMasson, PClaveau, DNicholson, DTurner, MYoung, RNGirard, Y Discovery of a substituted 8-arylquinoline series of PDE4 inhibitors: structure-activity relationship, optimization, and identification of a highly potent, well tolerated, PDE4 inhibitor. Bioorg Med Chem Lett 15:5241-6 (2005)  
Target
Name:
cAMP-specific 3',5'-cyclic phosphodiesterase 4B
Synonyms:
3',5'-cyclic phosphodiesterase Isoform PDE4B1 PDE4B PDE4B_HUMAN Phosphodiesterase 4B (PDE4B) Phosphodiesterase Type 4 (PDE4B)
Type:
Protein
Mol. Mass.:
83318.87
Organism:
Homo sapiens (Human)
Description:
Q07343
Residue:
736
  
Inhibitor
Name:
BDBM50174025
Synonyms:
6-isopropyl-8-(3-(2-(4-(methylsulfonyl)phenyl)-2-(thiazol-2-yl)vinyl)phenyl)quinoline | CHEMBL196969
Type:
Small organic molecule
Emp. Form.:
C30H26N2O2S2
Mol. Mass.:
510.67
SMILES:
CC(C)c1cc(-c2cccc(\C=C(\c3nccs3)c3ccc(cc3)S(C)(=O)=O)c2)c2ncccc2c1
: