Target
Estrogen receptor
Ligand
BDBM50178326
Substrate
Meas. Tech.
ChEMBL_332772 (CHEMBL859110)
EC50
3237±n/a nM
Citation
 Blizzard, TAGude, CMorgan, JDChan, WBirzin, ETMojena, MTudela, CChen, FKnecht, KSu, QKraker, BMosley, RTHolmes, MASharma, NFitzgerald, PMRohrer, SPHammond, ML Androstenediol analogs as ER-beta-selective SERMs. Bioorg Med Chem Lett 16:834-8 (2006)  
Target
Name:
Estrogen receptor
Synonyms:
ER ESR ESR1_HUMAN Estrogen receptor Estrogen receptor (ER-alpha) Estrogen receptor alpha (ER) Nuclear receptor subfamily 3 group A member 1
Type:
Protein
Mol. Mass.:
66230.44
Organism:
Homo sapiens (Human)
Description:
P03372
Residue:
595
  
Inhibitor
Name:
BDBM50178326
Synonyms:
(3S,10R,13S,17S,Z)-10-(2-methoxyvinyl)-13-methyl-2,3,4,7,8,9,10,11,12,13,14,15,16,17-tetradecahydro-1H-cyclopenta[a]phenanthrene-3,17-diol | CHEMBL380876
Type:
Small organic molecule
Emp. Form.:
C21H32O3
Mol. Mass.:
332.477
SMILES:
CO\C=C/[C@]12CC[C@H](O)CC1=CCC1C3CC[C@H](O)[C@@]3(C)CCC21
: