Target
Adenosine receptor A2a
Ligand
BDBM50117109
Substrate
Meas. Tech.
ChEMBL_337184 (CHEMBL862544)
Ki
65±n/a nM
Citation
 Pastorin, GDa Ros, TBolcato, CMontopoli, CMoro, SCacciari, BBaraldi, PGVarani, KBorea, PASpalluto, G Synthesis and biological studies of a new series of 5-heteroarylcarbamoylaminopyrazolo[4,3-e]1,2,4-triazolo[1,5-c]pyrimidines as human A3 adenosine receptor antagonists. Influence of the heteroaryl substituent on binding affinity and molecular modeling investigations. J Med Chem 49:1720-9 (2006)  
Target
Name:
Adenosine receptor A2a
Synonyms:
A2A adenosine receptor (hA2A) ADENOSINE A2 ADORA2 Adenosine A2A receptor (A2AAR)
Type:
G Protein-Coupled Receptor (GPCR)
Mol. Mass.:
44716.46
Organism:
Homo sapiens (Human)
Description:
P29274
Residue:
412
  
Inhibitor
Name:
BDBM50117109
Synonyms:
1-(2-Furan-2-yl-8-methyl-8H-pyrazolo[4,3-e][1,2,4]triazolo[1,5-c]pyrimidin-5-yl)-3-pyridin-4-yl-urea CHEMBL332091
Type:
Small organic molecule
Emp. Form.:
C17H13N9O2
Mol. Mass.:
375.3442
SMILES:
Cn1cc2c(n1)nc(NC(=O)Nc1ccncc1)n1nc(nc21)-c1ccco1
: