Target
Proto-oncogene tyrosine-protein kinase Src
Ligand
BDBM50187729
Substrate
Meas. Tech.
ChEMBL_361955 (CHEMBL859180)
IC50
6400±n/a nM
Citation
 Kumar, AYe, GWang, YLin, XSun, GParang, K Synthesis and structure-activity relationships of linear and conformationally constrained peptide analogues of CIYKYY as Src tyrosine kinase inhibitors. J Med Chem 49:3395-401 (2006)  
Target
Name:
Proto-oncogene tyrosine-protein kinase Src
Synonyms:
Calmodulin/Proto-oncogene tyrosine-protein kinase Src Proto-oncogene c-Src SRC SRC_HUMAN V-src sarcoma (Schmidt-Ruppin A-2) viral oncogene homolog (avian) p60-Src | pp60c-src
Type:
Protein
Mol. Mass.:
59838.60
Organism:
Homo sapiens (Human)
Description:
P12931
Residue:
536
  
Inhibitor
Name:
BDBM50187729
Synonyms:
CHEMBL429525 | Cyclo[Ac-Cys-Ile-Tyr-Lys-Tyr-Tyr]
Type:
Small organic molecule
Emp. Form.:
C42H55N7O9S
Mol. Mass.:
833.993
SMILES:
CC[C@H](C)[C@@H]1NC(=O)[C@H](CS)NC(=O)[C@H](Cc2ccc(O)cc2)NC(=O)[C@H](Cc2ccc(O)cc2)NC(=O)[C@H](CCCCN)NC(=O)[C@H](Cc2ccc(O)cc2)NC1=O
: