Target
Solute carrier family 15 member 1
Ligand
BDBM50169125
Substrate
Meas. Tech.
ChEMBL_363882 (CHEMBL863213)
IC50
280000±n/a nM
Citation
 Vig, BSStouch, TRTimoszyk, JKQuan, YWall, DASmith, RLFaria, TN Human PEPT1 pharmacophore distinguishes between dipeptide transport and binding. J Med Chem 49:3636-44 (2006)  
Target
Name:
Solute carrier family 15 member 1
Synonyms:
Intestinal H(+)/peptide cotransporter Oligopeptide transporter, small intestine isoform Peptide transporter 1 SLC15A1
Type:
PROTEIN
Mol. Mass.:
78818.07
Organism:
Homo sapiens (Human)
Description:
ChEMBL_1488839
Residue:
708
  
Inhibitor
Name:
BDBM50169125
Synonyms:
(S)-6-Amino-2-((S)-2-amino-propionylamino)-hexanoic acid Ala-Lys | CHEMBL191057
Type:
Small organic molecule
Emp. Form.:
C9H19N3O3
Mol. Mass.:
217.2655
SMILES:
C[C@H](N)C(=O)N[C@@H](CCCCN)C(O)=O
: