Target
Solute carrier family 15 member 1
Ligand
BDBM50188521
Substrate
Meas. Tech.
ChEMBL_363882 (CHEMBL863213)
IC50
210000±n/a nM
Citation
 Vig, BSStouch, TRTimoszyk, JKQuan, YWall, DASmith, RLFaria, TN Human PEPT1 pharmacophore distinguishes between dipeptide transport and binding. J Med Chem 49:3636-44 (2006)  
Target
Name:
Solute carrier family 15 member 1
Synonyms:
Intestinal H(+)/peptide cotransporter Oligopeptide transporter, small intestine isoform Peptide transporter 1 SLC15A1
Type:
PROTEIN
Mol. Mass.:
78818.07
Organism:
Homo sapiens (Human)
Description:
ChEMBL_1488839
Residue:
708
  
Inhibitor
Name:
BDBM50188521
Synonyms:
(S)-2-((S)-2-Amino-3-methyl-butyrylamino)-3-methyl-butyric acid CHEMBL54552 | Val-Val
Type:
Small organic molecule
Emp. Form.:
C10H20N2O3
Mol. Mass.:
216.2774
SMILES:
CC(C)[C@H](N)C(=O)N[C@@H](C(C)C)C(O)=O
: