Target
D(1A) dopamine receptor
Ligand
BDBM50189854
Substrate
Meas. Tech.
ChEMBL_367035 (CHEMBL864944)
Ki
7100±n/a nM
Citation
 Enguehard-Gueiffier, CHübner, HEl Hakmaoui, AAllouchi, HGmeiner, PArgiolas, AMelis, MRGueiffier, A 2-[(4-phenylpiperazin-1-yl)methyl]imidazo(di)azines as selective D4-ligands. Induction of penile erection by 2-[4-(2-methoxyphenyl)piperazin-1-ylmethyl]imidazo[1,2-a]pyridine (PIP3EA), a potent and selective D4 partial agonist. J Med Chem 49:3938-47 (2006)  
Target
Name:
D(1A) dopamine receptor
Synonyms:
DRD1 Dopamine D1 receptor
Type:
PROTEIN
Mol. Mass.:
49269.92
Organism:
Sus scrofa
Description:
ChEMBL_1460140
Residue:
446
  
Inhibitor
Name:
BDBM50189854
Synonyms:
6-bromo-2-[4-(2-methoxyphenyl)piperazin-1-ylmethyl]imidazo[1,2-a]pyridine | CHEMBL211164
Type:
Small organic molecule
Emp. Form.:
C19H21BrN4O
Mol. Mass.:
401.3
SMILES:
COc1ccccc1N1CCN(Cc2cn3cc(Br)ccc3n2)CC1
: