Target
Acetyl-CoA carboxylase 1
Ligand
BDBM50189619
Substrate
Meas. Tech.
ChEMBL_368468 (CHEMBL867452)
IC50
>30000±n/a nM
Citation
 Gu, YGWeitzberg, MClark, RFXu, XLi, QZhang, THansen, TMLiu, GXin, ZWang, XWang, RMcNally, TZinker, BAFrevert, EUCamp, HSCamp, HBeutel, BASham, HL Synthesis and structure-activity relationships of N-{3-[2-(4-alkoxyphenoxy)thiazol-5-yl]-1- methylprop-2-ynyl}carboxy derivatives as selective acetyl-CoA carboxylase 2 inhibitors. J Med Chem 49:3770-3 (2006)  
Target
Name:
Acetyl-CoA carboxylase 1
Synonyms:
ACAC ACACA_HUMAN ACC1 Acetyl-CoA carboxylase 1 | Acetyl-CoA carboxylase 1 (ACC1)
Type:
Protein
Mol. Mass.:
265543.22
Organism:
Homo sapiens (Human)
Description:
Q13085
Residue:
2346
  
Inhibitor
Name:
BDBM50189619
Synonyms:
1-methyl-3-[2-(4-phenoxy-phenoxy)-thiazol-5-yl]-prop-2-ynylamine | CHEMBL377369
Type:
Small organic molecule
Emp. Form.:
C19H16N2O2S
Mol. Mass.:
336.408
SMILES:
CC(N)C#Cc1cnc(Oc2ccc(Oc3ccccc3)cc2)s1
: