Target
5-hydroxytryptamine receptor 1A
Ligand
BDBM50191617
Substrate
Meas. Tech.
ChEMBL_376264 (CHEMBL864775)
Ki
34.9±n/a nM
Citation
 Hatzenbuhler, NTEvrard, DAHarrison, BLHuryn, DInghrim, JKraml, CMattes, JFMewshaw, REZhou, DHornby, GLin, QSmith, DLSullivan, KMSchechter, LEBeyer, CEAndree, TH Synthesis and biological evaluation of novel compounds within a class of 3-aminochroman derivatives with dual 5-HT1A receptor and serotonin transporter affinity. J Med Chem 49:4785-9 (2006)  
Target
Name:
5-hydroxytryptamine receptor 1A
Synonyms:
5-HT-1A 5-hydroxytryptamine receptor 1A (5-HT-1A) ADRB2RL1 Dopamine D2 receptor and serotonin 1a receptor HTR1A | Serotonin receptor 1A
Type:
Mol. Mass.:
46122.49
Organism:
Homo sapiens (Human)
Description:
Residue:
422
  
Inhibitor
Name:
BDBM50191617
Synonyms:
(R)-3-(ethyl(3-(5-fluoro-1H-indol-3-yl)propyl)amino)-8-fluoro-3,4-dihydro-2H-chromene-5-carboxamide | CHEMBL211393
Type:
Small organic molecule
Emp. Form.:
C23H25F2N3O2
Mol. Mass.:
413.4603
SMILES:
CCN(CCCc1c[nH]c2ccc(F)cc12)[C@H]1COc2c(F)ccc(C(N)=O)c2C1
: