Target
Sodium-dependent serotonin transporter
Ligand
BDBM50191626
Substrate
Meas. Tech.
ChEMBL_376263 (CHEMBL864774)
IC50
116±n/a nM
Citation
 Hatzenbuhler, NTEvrard, DAHarrison, BLHuryn, DInghrim, JKraml, CMattes, JFMewshaw, REZhou, DHornby, GLin, QSmith, DLSullivan, KMSchechter, LEBeyer, CEAndree, TH Synthesis and biological evaluation of novel compounds within a class of 3-aminochroman derivatives with dual 5-HT1A receptor and serotonin transporter affinity. J Med Chem 49:4785-9 (2006)  
Target
Name:
Sodium-dependent serotonin transporter
Synonyms:
5-HT Transporter 5HTT SC6A4_HUMAN SLC6A4 Serotonin transporter (5HTT) Sodium-dependent serotonin transporter (SERT) | Solute carrier family 6 member 4
Type:
Multi-pass membrane protein
Mol. Mass.:
70322.51
Organism:
Homo sapiens (Human)
Description:
P31645
Residue:
630
  
Inhibitor
Name:
BDBM50191626
Synonyms:
(3R)-8-fluoro-3-[[3-(5-fluoro-1H-indol-3-yl)propyl](methyl)amino]chromane-5-carboxamide | CHEMBL386242
Type:
Small organic molecule
Emp. Form.:
C22H23F2N3O2
Mol. Mass.:
399.4337
SMILES:
CN(CCCc1c[nH]c2ccc(F)cc12)[C@H]1COc2c(F)ccc(C(N)=O)c2C1
: