Target
Sodium-dependent serotonin transporter
Ligand
BDBM50191632
Substrate
Meas. Tech.
ChEMBL_376262 (CHEMBL864773)
Ki
2.2±n/a nM
Citation
 Hatzenbuhler, NTEvrard, DAHarrison, BLHuryn, DInghrim, JKraml, CMattes, JFMewshaw, REZhou, DHornby, GLin, QSmith, DLSullivan, KMSchechter, LEBeyer, CEAndree, TH Synthesis and biological evaluation of novel compounds within a class of 3-aminochroman derivatives with dual 5-HT1A receptor and serotonin transporter affinity. J Med Chem 49:4785-9 (2006)  
Target
Name:
Sodium-dependent serotonin transporter
Synonyms:
5-HT Transporter 5HT transporter Anandamid membrane transporter, AMT Monoamine transporters; Norepinephrine & serotonin Slc6a4 Sodium-dependent serotonin transporter (SERT) | imipramine receptor
Type:
Multi-pass membrane protein
Mol. Mass.:
70168.43
Organism:
Rattus norvegicus (rat)
Description:
P31652
Residue:
630
  
Inhibitor
Name:
BDBM50191632
Synonyms:
CHEMBL209262 | rac-N-ethyl-N-[3-(5-fluoro-1H-indol-3-yl)propyl]-5-methoxychroman-3-amine
Type:
Small organic molecule
Emp. Form.:
C23H27FN2O2
Mol. Mass.:
382.4711
SMILES:
CCN(CCCc1c[nH]c2ccc(F)cc12)C1COc2cccc(OC)c2C1
: