Target
Sodium-dependent serotonin transporter
Ligand
BDBM50191639
Substrate
Meas. Tech.
ChEMBL_376263 (CHEMBL864774)
IC50
386±n/a nM
Citation
 Hatzenbuhler, NTEvrard, DAHarrison, BLHuryn, DInghrim, JKraml, CMattes, JFMewshaw, REZhou, DHornby, GLin, QSmith, DLSullivan, KMSchechter, LEBeyer, CEAndree, TH Synthesis and biological evaluation of novel compounds within a class of 3-aminochroman derivatives with dual 5-HT1A receptor and serotonin transporter affinity. J Med Chem 49:4785-9 (2006)  
Target
Name:
Sodium-dependent serotonin transporter
Synonyms:
5-HT Transporter 5HTT SC6A4_HUMAN SLC6A4 Serotonin transporter (5HTT) Sodium-dependent serotonin transporter (SERT) | Solute carrier family 6 member 4
Type:
Multi-pass membrane protein
Mol. Mass.:
70322.51
Organism:
Homo sapiens (Human)
Description:
P31645
Residue:
630
  
Inhibitor
Name:
BDBM50191639
Synonyms:
CHEMBL378073 N-[3-(5-Fluoro-1H-indol-3-yl)propyl]-5-methoxy-N-propylchroman-3-amine | rac-[3-(5-fluoro-1H-indol-3-yl)-propyl]-(5-methoxy-chroman-3-yl)-propyl-amine
Type:
Small organic molecule
Emp. Form.:
C24H29FN2O2
Mol. Mass.:
396.4977
SMILES:
CCCN(CCCc1c[nH]c2ccc(F)cc12)C1COc2cccc(OC)c2C1
: