Target
5-hydroxytryptamine receptor 1A
Ligand
BDBM50191632
Substrate
Meas. Tech.
ChEMBL_376264 (CHEMBL864775)
Ki
2.3±n/a nM
Citation
 Hatzenbuhler, NTEvrard, DAHarrison, BLHuryn, DInghrim, JKraml, CMattes, JFMewshaw, REZhou, DHornby, GLin, QSmith, DLSullivan, KMSchechter, LEBeyer, CEAndree, TH Synthesis and biological evaluation of novel compounds within a class of 3-aminochroman derivatives with dual 5-HT1A receptor and serotonin transporter affinity. J Med Chem 49:4785-9 (2006)  
Target
Name:
5-hydroxytryptamine receptor 1A
Synonyms:
5-HT-1A 5-hydroxytryptamine receptor 1A (5-HT-1A) ADRB2RL1 Dopamine D2 receptor and serotonin 1a receptor HTR1A | Serotonin receptor 1A
Type:
Mol. Mass.:
46122.49
Organism:
Homo sapiens (Human)
Description:
Residue:
422
  
Inhibitor
Name:
BDBM50191632
Synonyms:
CHEMBL209262 | rac-N-ethyl-N-[3-(5-fluoro-1H-indol-3-yl)propyl]-5-methoxychroman-3-amine
Type:
Small organic molecule
Emp. Form.:
C23H27FN2O2
Mol. Mass.:
382.4711
SMILES:
CCN(CCCc1c[nH]c2ccc(F)cc12)C1COc2cccc(OC)c2C1
: