Target
Sodium-dependent dopamine transporter
Ligand
BDBM30130
Substrate
Meas. Tech.
ChEMBL_390294 (CHEMBL869836)
IC50
4400±n/a nM
Citation
 Jonathan Fray, MBish, GBrown, ADFish, PVStobie, AWakenhut, FWhitlock, GA N-(1,2-diphenylethyl)piperazines: a new class of dual serotonin/noradrenaline reuptake inhibitor. Bioorg Med Chem Lett 16:4345-8 (2006)  
Target
Name:
Sodium-dependent dopamine transporter
Synonyms:
DA transporter DAT1 Dopamine transporter protein (DAT) SC6A3_HUMAN Sodium-dependent dopamine transporter Solute carrier family 6 member 3
Type:
Multi-pass membrane protein
Mol. Mass.:
68497.11
Organism:
Homo sapiens (Human)
Description:
Q01959
Residue:
620
  
Inhibitor
Name:
BDBM30130
Synonyms:
CHEMBL1201082 Fluoxetin Prozac cid_62857
Type:
Small organic molecule
Emp. Form.:
C17H18F3NO
Mol. Mass.:
309.3261
SMILES:
CNCCC(Oc1ccc(cc1)C(F)(F)F)c1ccccc1
: