Target
Delta-type opioid receptor
Ligand
BDBM50194266
Substrate
Meas. Tech.
ChEMBL_392922 (CHEMBL870416)
Ki
0.240000±n/a nM
Citation
 Wentland, MPVanAlstine, MKucejko, RLou, RCohen, DJParkhill, ALBidlack, JM Redefining the structure-activity relationships of 2,6-methano-3-benzazocines. 4. Opioid receptor binding properties of 8-[N-(4'-phenyl)-phenethyl)carboxamido] analogues of cyclazocine and ethylketocycalzocine. J Med Chem 49:5635-9 (2006)  
Target
Name:
Delta-type opioid receptor
Synonyms:
D-OR-1 Delta opioid receptor OPIATE Delta OPRD1 OPRK1 | opioid receptor, delta 1
Type:
G Protein-Coupled Receptor (GPCR)
Mol. Mass.:
40382.98
Organism:
Homo sapiens (Human)
Description:
Competition binding assays were carried out using membrane preparations from transfected HN9.10 cells that constitutively expressed the delta opioid receptor.
Residue:
372
  
Inhibitor
Name:
BDBM50194266
Synonyms:
(-)-3-(cyclopropylmethyl)-1,2,3,4,5,6-hexahydro-cis-6,11-dimethyl-N-(2-[1,1'-biphenyl]-4-ylethyl)-2,6-methano-3-benzazocine-8-carboxamide | CHEMBL210005
Type:
Small organic molecule
Emp. Form.:
C33H38N2O
Mol. Mass.:
478.6676
SMILES:
C[C@H]1[C@H]2Cc3ccc(cc3[C@]1(C)CCN2CC1CC1)C(=O)NCCc1ccc(cc1)-c1ccccc1
: