Target
Kappa-type opioid receptor
Ligand
BDBM50194271
Substrate
Meas. Tech.
ChEMBL_392923 (CHEMBL870417)
Ki
1.7±n/a nM
Citation
 Wentland, MPVanAlstine, MKucejko, RLou, RCohen, DJParkhill, ALBidlack, JM Redefining the structure-activity relationships of 2,6-methano-3-benzazocines. 4. Opioid receptor binding properties of 8-[N-(4'-phenyl)-phenethyl)carboxamido] analogues of cyclazocine and ethylketocycalzocine. J Med Chem 49:5635-9 (2006)  
Target
Name:
Kappa-type opioid receptor
Synonyms:
K-OR-1 Kappa-opioid receptor (KOR) Kappa-type opioid receptor (KOR) OPIATE Kappa OPRK1 kappa opioid receptor (KOR)
Type:
G Protein-Coupled Receptor (GPCR)
Mol. Mass.:
42648.76
Organism:
Homo sapiens (Human)
Description:
P41145
Residue:
380
  
Inhibitor
Name:
BDBM50194271
Synonyms:
(+/-)-3-(cyclopropylmethyl)-1,2,3,4,5,6-hexahydro-cis-6,11-dimethyl-N-(2-phenylethyl)-2,6-methano-3-benzazocine-8-carboxamide | CHEMBL209550
Type:
Small organic molecule
Emp. Form.:
C27H34N2O
Mol. Mass.:
402.5717
SMILES:
C[C@H]1C2Cc3ccc(cc3[C@@]1(C)CCN2CC1CC1)C(=O)NCCc1ccccc1
: