Target
Peptide deformylase
Ligand
BDBM50201878
Substrate
Meas. Tech.
ChEMBL_423229 (CHEMBL913367)
IC50
30±n/a nM
Citation
 Boularot, AGiglione, CPetit, SDuroc, YAlves de Sousa, RLarue, VCresteil, TDardel, FArtaud, IMeinnel, T Discovery and refinement of a new structural class of potent peptide deformylase inhibitors. J Med Chem 50:10-20 (2007)  
Target
Name:
Peptide deformylase
Synonyms:
3.5.1.88 BON94_18585 D9G11_25760 FORC82_p394 Polypeptide deformylase def | def_2
Type:
Mol. Mass.:
16901.39
Organism:
Escherichia coli
Description:
Residue:
150
  
Inhibitor
Name:
BDBM50201878
Synonyms:
CHEMBL220027 | N-(1-benzenesulfonyl-5-bromo-2-methyl-1H-indol-3-ylmethyl)-N-hydroxyformamide
Type:
Small organic molecule
Emp. Form.:
C17H15BrN2O4S
Mol. Mass.:
423.281
SMILES:
Cc1c(CN(O)C=O)c2cc(Br)ccc2n1S(=O)(=O)c1ccccc1
: