Target
Peptide deformylase
Ligand
BDBM50201884
Substrate
Meas. Tech.
ChEMBL_423229 (CHEMBL913367)
IC50
27±n/a nM
Citation
 Boularot, AGiglione, CPetit, SDuroc, YAlves de Sousa, RLarue, VCresteil, TDardel, FArtaud, IMeinnel, T Discovery and refinement of a new structural class of potent peptide deformylase inhibitors. J Med Chem 50:10-20 (2007)  
Target
Name:
Peptide deformylase
Synonyms:
3.5.1.88 BON94_18585 D9G11_25760 FORC82_p394 Polypeptide deformylase def | def_2
Type:
Mol. Mass.:
16901.39
Organism:
Escherichia coli
Description:
Residue:
150
  
Inhibitor
Name:
BDBM50201884
Synonyms:
5-bromo-3-hydroxycarbamoylmethylindole-1-carboxylic acid | CHEMBL386468
Type:
Small organic molecule
Emp. Form.:
C19H17BrN2O4
Mol. Mass.:
417.253
SMILES:
ONCC(=O)Cc1cn(C(=O)OCc2ccccc2)c2ccc(Br)cc12
: