Target
Peptide deformylase, mitochondrial
Ligand
BDBM50201871
Substrate
Meas. Tech.
ChEMBL_423227 (CHEMBL912248)
IC50
700000±n/a nM
Citation
 Boularot, AGiglione, CPetit, SDuroc, YAlves de Sousa, RLarue, VCresteil, TDardel, FArtaud, IMeinnel, T Discovery and refinement of a new structural class of potent peptide deformylase inhibitors. J Med Chem 50:10-20 (2007)  
Target
Name:
Peptide deformylase, mitochondrial
Synonyms:
DEFM_HUMAN PDF1A Peptide deformylase, mitochondrial | Polypeptide deformylase
Type:
PROTEIN
Mol. Mass.:
27023.25
Organism:
Homo sapiens (Human)
Description:
ChEMBL_154318
Residue:
243
  
Inhibitor
Name:
BDBM50201871
Synonyms:
2-(4-fluoro-1H-indol-3-yl)-N-hydroxyacetamide | CHEMBL373862
Type:
Small organic molecule
Emp. Form.:
C11H11FN2O2
Mol. Mass.:
222.2156
SMILES:
ONCC(=O)Cc1c[nH]c2cccc(F)c12
: