Target
Peptide deformylase
Ligand
BDBM50201873
Substrate
Meas. Tech.
ChEMBL_423229 (CHEMBL913367)
IC50
210±n/a nM
Citation
 Boularot, AGiglione, CPetit, SDuroc, YAlves de Sousa, RLarue, VCresteil, TDardel, FArtaud, IMeinnel, T Discovery and refinement of a new structural class of potent peptide deformylase inhibitors. J Med Chem 50:10-20 (2007)  
Target
Name:
Peptide deformylase
Synonyms:
3.5.1.88 BON94_18585 D9G11_25760 FORC82_p394 Polypeptide deformylase def | def_2
Type:
Mol. Mass.:
16901.39
Organism:
Escherichia coli
Description:
Residue:
150
  
Inhibitor
Name:
BDBM50201873
Synonyms:
2-(6-bromo-1H-indol-3-yl)-N-hydroxyacetamide | CHEMBL219438
Type:
Small organic molecule
Emp. Form.:
C11H11BrN2O2
Mol. Mass.:
283.121
SMILES:
ONCC(=O)Cc1c[nH]c2cc(Br)ccc12
: